{"text_format":"1","workbook":"xlsx","n_sheets":11,"sheets":["rozcesti","uvod A","podminky B","podminky C","konstrukce","ostatni vstupy","navrh opatreni a vysledky","help","vypocet","data","doplnit"],"not_rendered":{"charts":4,"images":2,"macros":1,"external_links":0,"defined_names":15,"comments":0,"pivot_tables":0},"unopened":[],"bounds":{"document_bytes":16777216,"sheet_cells":100000,"rows_first":2000,"rows_last":500,"rows_between":2000,"halvings":0,"cell_chars":16384,"cell_head_chars":4096},"cells_cut":0,"cells_raw":0,"read":"whole","date_system":"1900"}

{"sheet":"rozcesti","index":0,"n_rows":23,"n_cols":3,"rows_kept":23,"cut":false,"hidden":false,"merged":[[0,2,0,3]]}
[null,null,"Orientační výpočet dotace z programu Nová zelená úsporám 2013"]
[]
[]
[]
[]
[]
[]
[]
[null,null,"A - Snižování energetické náročnosti stávajících rodinných domů. \nMožná kombinace s C - výměna neekologického zdroje tepla, instalace termického solárního systému nebo instalace systému nuceného větrání se zpětným získáváním  (rekuperací) tepla."]
[null,null,"Dotace ze způsobilých výdajů 30, 40 nebo 55 %. "]
{"$rows_left_out":14}
{"sheet":"uvod A","index":1,"n_rows":30,"n_cols":3,"rows_kept":30,"cut":false,"hidden":false,"merged":[[31,1,31,2],[15,1,15,2],[22,1,22,2],[29,1,29,2],[17,1,17,2],[0,1,0,2],[1,1,1,2],[2,1,2,2],[4,1,4,2],[24,1,24,2]]}
[null,"Orientační výpočet pro program Nová zelená úsporám 2013 - Oblast A - Snižování energetické náročnosti RD"]
[null,"Tento výpočet nenahrazuje odborný posudek, ale slouží pro hrubé posouzení splnitelnosti podmínek programu."]
[null,"Tento nástroj umožňuje zadání tvarově jednoduchého RD s omezeným počtem stavebních konstrukcí."]
[]
[null,"Kritéria dosažení dotace jsou následující:"]
[null,"A.1: dotace 30 %"]
[null,"A.1.1"]
[null,"Podmínka 1","dosažení hodnoty průměrného součinitele prostupu tepla obálkou budovy Uem ve výši 0,95 násobku průměrného součinitele prostupu tepla referenční budovy "]
[null,"Podmínka 2","snížení vypočtené hodnoty měrné roční potřeby tepla na vytápění EA oproti stavu před realizací opatření alespoň o 40 %"]
[]
{"$rows_left_out":21}
{"sheet":"podminky B","index":2,"n_rows":21,"n_cols":5,"rows_kept":21,"cut":false,"hidden":false,"merged":[[22,1,22,2],[1,1,1,2],[2,1,2,2],[15,1,16,1],[15,2,16,2],[5,1,6,1],[5,2,6,2],[7,4,8,4],[9,1,10,1],[9,2,10,2],[9,3,10,3],[9,4,10,4],[7,1,8,1],[7,2,8,2],[0,1,0,4],[15,3,16,3],[15,4,16,4],[17,1,18,1],[17,2,18,2],[17,3,18,3],[17,4,18,4],[11,3,12,3],[11,4,12,4],[13,1,14,1],[13,2,14,2],[13,3,14,3],[13,4,14,4],[11,1,12,1],[11,2,12,2],[7,3,8,3]]}
[null,"Podmínky programu Nová zelená úsporám 2013 - Oblast B - Výstavba budov s velmi nízkou energetickou náročností"]
[]
[]
[]
[null,"Kritéria dosažení dotace:",null,"B.1: dotace 400 000 Kč","B.2: dotace 550 000 Kč"]
[null,"Sledované parametry","Označení       Jednotky","Oblast podpory","Oblast podpory"]
[null,null,null,"B.1","B.2"]
[null,"Měrná roční potřeba tepla na vytápění"," EA [kWh/m2.rok]","≤ 20","≤ 15"]
[]
[null,"Měrná neobnovitelná primární energie","EpN,A   [kWh/m2.rok]","≤ 90","≤ 60"]
{"$rows_left_out":12}
{"sheet":"podminky C","index":3,"n_rows":20,"n_cols":22,"rows_kept":20,"cut":false,"hidden":false,"merged":[[2,1,2,6],[3,1,3,6],[4,1,4,6],[0,1,0,7],[20,1,20,2]]}
[null,"Podmínky programu Nová zelená úsporám 2013 - Oblast C - \nEfektivní využití zdrojů energie a instalace termických solárních systémů."]
[]
[null,"Dotace slouží k podpoře výměny neekologických kotlů na tuhá a vyjmenovaná kapalná paliva v objektech s měrnou potřebou tepla na vytápění nižší než 150 kWh/m2.rok."]
[null,"Dále lze instalovat solární systém pro ohřev vody nebo pro ohřev vody a přitápění.",null,null,null,null,null,null,null,null,null,null,null,null,null,null,null,null,null,null,null,{"$f":"data!AD2","v":"Bez výměny"}]
[null,"Podporována je také instalace větracích systémů s rekuperací tepla z odpadního vzduchu, \nale pouze v kombinaci s komplexním zateplením budov (Oblast A).",null,null,null,null,null,null,null,null,null,null,null,null,null,null,null,null,null,null,null,{"$f":"data!AD3","v":"Kotel na biomasu s ruční dodávkou paliva"}]
[null,null,null,null,null,null,null,null,null,null,null,null,null,null,null,null,null,null,null,null,null,{"$f":"data!AD4","v":"Kotel na biomasu s automatickou dodávkou paliva"}]
[null,"Výměna neekologického zdroje tepla:",null,null,"Kotel na biomasu s automatickou dodávkou paliva",null,null,null,null,null,null,null,null,null,null,null,null,null,null,null,null,{"$f":"data!AD5","v":"Krbová kamna na biomasu s výměníkem s ruční dodávkou paliva"}]
[null,"Instalace solárního systému:",null,null,"Solární systém pro ohřev vody",null,null,null,null,null,null,null,null,null,null,null,null,null,null,null,null,{"$f":"data!AD6","v":"Krbová kamna na biomasu s výměníkem se samočinnou dodávkou paliva"}]
[null,null,null,null,null,null,null,null,null,null,null,null,null,null,null,null,null,null,null,null,null,{"$f":"data!AD7","v":"Tepelné čerpadlo voda-voda"}]
[null,null,null,null,null,null,null,null,null,null,null,null,null,null,null,null,null,null,null,null,null,{"$f":"data!AD8","v":"Tepelné čerpadlo země – voda"}]
{"$rows_left_out":11}
{"sheet":"konstrukce","index":4,"n_rows":35,"n_cols":13,"rows_kept":35,"cut":false,"hidden":false,"merged":[[36,9,36,10],[0,1,0,5],[36,1,36,2],[36,3,36,4],[36,5,36,6],[36,7,36,8]]}
[null,"Popis stavebních konstrukcí",null,null,null,null,null,null,"Zpět","Pokračovat","Nápověda"]
[]
[null,"Obvodové stěny mezi vytápěnou částí a venkovním prostředím","Výška (m)","Délka (m)","Hrubá plocha včetně oken (m2)","Materiál stěny","Existující zateplení (cm)",null,"Okna a dveře - 1. typ (celková plocha) (m2)","Typ oken nebo dveří","Okna a dveře - 2. typ (celková plocha) (m2)","Typ oken nebo dveří","Čistá plocha stěny (m2)"]
[null,"Severní stěna 1",null,null,{"$f":"C4*D4","v":0},null,null,null,null,null,null,null,{"$f":"E4-I4-K4","v":0}]
[null,"Severní stěna 2",null,null,{"$f":"C5*D5","v":0},null,null,null,null,null,null,null,{"$f":"E5-I5-K5","v":0}]
[]
[null,"Jižní stěna 1",null,null,{"$f":"C7*D7","v":0},null,null,null,null,null,null,null,{"$f":"E7-I7-K7","v":0}]
[null,"Jižní stěna 2",null,null,0,null,null,null,null,null,null,null,{"$f":"E8-I8-K8","v":0}]
[]
[null,"Východní stěna 1",null,null,0,null,null,null,null,null,null,null,{"$f":"E10-I10-K10","v":0}]
{"$rows_left_out":26}
{"sheet":"ostatni vstupy","index":5,"n_rows":19,"n_cols":11,"rows_kept":19,"cut":false,"hidden":false,"merged":[[0,1,0,5],[18,5,18,10],[19,5,19,10],[23,0,23,4],[23,5,23,9],[23,10,23,11]]}
[null,"Ostatní vstupy",null,null,null,null,null,null,"Zpět","Pokračovat","Nápověda"]
[]
[null,"Objem vytápěné části budovy",null,null,"m3"]
[]
[null,"Pomocná kalkulačka pro základní tvar",null,"délka (m)"]
[null,null,"a"]
[null,null,"b"]
[null,null,"c"]
[null,null,"d"]
[null,null,"e"]
{"$rows_left_out":10}
{"sheet":"navrh opatreni a vysledky","index":6,"n_rows":41,"n_cols":37,"rows_kept":41,"cut":false,"hidden":false,"merged":[[0,1,0,5],[16,6,16,8],[16,10,16,12],[3,11,3,13],[59,1,59,2]]}
[null,"Návrh opatření a výsledky",null,null,null,null,null,null,"Zpět",null,"Nápověda",null,null,null,null,null,null,null,null,null,null,null,null,null,null,null,null,"ponechat v původním stavu",0,null,null,"Požadavek ZÚ na dotaci 30 %",null,null,null,null,{"$f":"data!AD2","v":"Bez výměny"}]
[null,null,null,null,null,null,null,null,null,null,null,null,null,null,null,null,null,null,null,null,null,null,null,null,null,null,null,"zateplit na doporučenou hodnotu",1,null,null,"Požadavek ZÚ na dotaci 40 %",null,null,null,null,{"$f":"data!AD3","v":"Kotel na biomasu s ruční dodávkou paliva"}]
[null,null,null,null,null,null,null,null,null,null,null,null,null,null,null,null,null,null,null,null,null,null,"kontrola zadání konstrukcí","uznatelné náklady",null,"opatření",null,"zateplit na lepší než doporučenou hodnotu",2,null,null,"Požadavek ZÚ na dotaci 55 %",null,null,null,null,{"$f":"data!AD4","v":"Kotel na biomasu s automatickou dodávkou paliva"}]
[null,"Severní stěna",null,null,null,null,null,null,null,null,null,null,null,null,null,null,null,null,null,null,null,null,{"$f":"vypocet!J4+vypocet!J5","v":0},{"$f":"IF(Z4=0,0,W4*data!$AB$3)","v":0},null,{"$f":"IF(C4=$AB$1,$AC$1,IF(C4=$AB$2,$AC$2,IF(C4=$AB$3,$AC$3,IF(C4=$AB$4,$AC$4,IF(C4=$AB$5,$AC$5,\"chyba\")))))","v":"chyba"},null,"zateplit na min. hodnotu pro pasivní domy",3,null,null,"Původní stav",null,null,null,null,{"$f":"data!AD5","v":"Krbová kamna na biomasu s výměníkem s ruční dodávkou paliva"}]
[null,"Jižní stěna","ponechat v původním stavu",null,null,null,null,null,null,null,null,0.3,0.4,0.55000000000000004,null,null,null,null,null,null,null,null,{"$f":"vypocet!J7+vypocet!J8","v":0},{"$f":"IF(Z5=0,0,W5*data!$AB$3)","v":0},null,{"$f":"IF(C5=$AB$1,$AC$1,IF(C5=$AB$2,$AC$2,IF(C5=$AB$3,$AC$3,IF(C5=$AB$4,$AC$4,IF(C5=$AB$5,$AC$5,\"chyba\")))))","v":0},null,"zateplit na max. hodnotu pro pasivní domy",4,null,null,"Stav po opatřeních",null,null,null,null,{"$f":"data!AD6","v":"Krbová kamna na biomasu s výměníkem se samočinnou dodávkou paliva"}]
[null,"Východní stěna","ponechat v původním stavu",null,"Původní měrná potřeba tepla na vytápění EV",null,null,null,null,{"$f":"IFERROR(vypocet!I207,0)","v":0},"kWh/m2,rok",null,null,null,null,null,null,null,null,null,null,null,{"$f":"vypocet!J10+vypocet!J11","v":0},{"$f":"IF(Z6=0,0,W6*data!$AB$3)","v":0},null,{"$f":"IF(C6=$AB$1,$AC$1,IF(C6=$AB$2,$AC$2,IF(C6=$AB$3,$AC$3,IF(C6=$AB$4,$AC$4,IF(C6=$AB$5,$AC$5,\"chyba\")))))","v":0},null,"ponechat v původním stavu",0,null,null,null,null,null,null,null,{"$f":"data!AD7","v":"Tepelné čerpadlo voda-voda"}]
[null,"Západní stěna","ponechat v původním stavu",null,"Nová měrná potřeba tepla na vytápění EV",null,null,null,null,{"$f":"IFERROR(vypocet!AE207,0)","v":0},"kWh/m2,rok",70,55,35,null,null,null,null,null,null,null,null,{"$f":"vypocet!J13+vypocet!J14","v":0},{"$f":"IF(Z7=0,0,W7*data!$AB$3)","v":0},null,{"$f":"IF(C7=$AB$1,$AC$1,IF(C7=$AB$2,$AC$2,IF(C7=$AB$3,$AC$3,IF(C7=$AB$4,$AC$4,IF(C7=$AB$5,$AC$5,\"chyba\")))))","v":0},null,"vyměnit za okna s dvojsklem",1,null,null,null,null,null,null,null,{"$f":"data!AD8","v":"Tepelné čerpadlo země – voda"}]
[null,null,null,null,"Pokles měrné potřeby tepla na vytápění",null,null,null,null,{"$f":"IFERROR((1-(J7/J6)),0)","v":0},null,0.4,0.5,0.6,null,null,null,null,null,null,null,null,null,null,null,null,null,"vyměnit za okna s trojsklem",2,null,null,null,null,null,null,null,{"$f":"data!AD9","v":"Tepelné čerpadlo vzduch-voda"}]
[null,"Podlaha na zemině","ponechat v původním stavu",null,null,null,null,null,null,{"$f":"J10/J11","v":{"$error":"#DIV/0!"}},null,null,null,null,null,null,null,null,null,null,null,null,{"$f":"vypocet!J17+vypocet!J18","v":0},{"$f":"IF(Z9=0,0,W9*data!AB8)","v":0},null,{"$f":"IF(C9=$AB$1,$AC$1,IF(C9=$AB$2,$AC$2,IF(C9=$AB$3,$AC$3,IF(C9=$AB$4,$AC$4,IF(C9=$AB$5,$AC$5,\"chyba\")))))","v":0},null,"vyměnit za okna s trojsklem - nejlepší",3,null,null,null,null,null,null,null,{"$f":"data!AD10","v":"Plynový kondenzační kotel"}]
[null,"Podlaha nad sklepem","ponechat v původním stavu",null,"Původní průměrný součinitel prostupu tepla Uem",null,null,null,null,{"$f":"IFERROR(vypocet!B79,0)","v":0},"W/m2,K",null,null,null,null,null,null,null,null,null,null,null,{"$f":"vypocet!J20+vypocet!J21","v":0},{"$f":"IF(Z10=0,0,W10*data!AB7)","v":0},null,{"$f":"IF(C10=$AB$1,$AC$1,IF(C10=$AB$2,$AC$2,IF(C10=$AB$3,$AC$3,IF(C10=$AB$4,$AC$4,IF(C10=$AB$5,$AC$5,\"chyba\")))))","v":0},null,null,null,null,null,null,null,null,null,null,{"$f":"data!AD11","v":"C3"}]
{"$rows_left_out":32}
{"sheet":"help","index":7,"n_rows":11,"n_cols":2,"rows_kept":11,"cut":false,"hidden":false,"merged":[]}
["Stavební konstrukce"]
["Plocha konstrukce se zadává pomocí rozměrů v metrech. Výsledek je v m2. Okna zadaná k dané konstrukci jsou od celkové plochy odečtena. Výpočet dále pracuje s hodnotou získanou po odečtení oken.","zpět"]
["Pokud není snadné zadat plochu pomocí násobení dvou rozměrů, lze ji zadat tak, že se do jednoho z rozměrů vloží vypočtená celková plocha a do druhého číslice 1."]
["Zadávají se pouze konstrukce mezi vytápěnou částí a venkovním prostředím nebo mezi vytápěnou a nevytápěnou částí budovy."]
["U konstrukcí nad vytápěným prostorem se uvádějí tyto části: střecha nebo strop k nevytápěné půdě. Pokud je střecha bez zateplení, zadává se pouze strop pod půdou.","zpět"]
["Kontrukce pod vytápěným prostorem mohou být buď podlaha na zemině nebo podlaha nad nevytápěným sklepem.","zpět"]
["V každé stěně se zadávají příslušná okna nebo dveře."]
["Existující zateplení předpokládá jako izolant polystyren nebo minerální vatu. Pro termoizolační omítku zadejte poloviční hodnotu.","zpět"]
["Do objemu budovy se vkládá vypočtený objem vytápěné části budovy včetně všech vnitřních konstrukcí. Pro jednoduchý tvar je možné použít kalkulačku.","zpět"]
["Zateplení na \"lepší než doporučenou hodnotu\" znamená splnění požadavku 0,95 * UR","zpět"]
{"$rows_left_out":2}
{"sheet":"vypocet","index":8,"n_rows":208,"n_cols":43,"rows_kept":208,"cut":false,"hidden":true,"merged":[]}
["Současný stav",null,null,null,null,null,null,null,null,null,null,null,null,"Referenční budova",null,null,null,null,null,null,null,null,"Nový stav"]
["výpočet Ht",null,"lanbda původní izolace",null,0.05,null,null,null,null,null,null,null,null,"výpočet Ht",null,5.5E-2,null,null,null,null,null,null,{"$f":"A2","v":"výpočet Ht"}]
["konstrukce","kód","popis","Uzáklad","zateplení","Rsi","Rse","Rpův","Ucelk","A","b","Ucelk*A*b",null,"konstrukce",null,null,"Unorm","A","b","Ucelk*A*b",null,null,{"$f":"A3","v":"konstrukce"},null,"A","opatření","U původní","U norm","U norm 0,95","U pas min","U pas max","U vybrané","b","U*A*b"]
[{"$f":"konstrukce!B4","v":"Severní stěna 1"},1,{"$f":"VLOOKUP(vypocet!B4,data!$A$3:$B$23,2)","v":"Cihly plné 30 cm"},{"$f":"VLOOKUP(B4,data!$A$3:$C$23,3)","v":1.67},{"$f":"konstrukce!G4","v":0},0.13,0.04,{"$f":"1/D4-F4-G4","v":0.42880239520958091},{"$f":"1/(F4+G4+(E4/100)/$E$2+H4)","v":1.67},{"$f":"konstrukce!M4","v":0},1,{"$f":"I4*J4*K4","v":0},null,{"$f":"A4","v":"Severní stěna 1"},null,null,0.3,{"$f":"J4","v":0},{"$f":"K4","v":1},{"$f":"Q4*R4*S4","v":0},null,null,"Severní stěna 1",null,{"$f":"R4","v":0},{"$f":"'navrh opatreni a vysledky'!Z4","v":"chyba"},{"$f":"I4","v":1.67},{"$f":"VLOOKUP(B4,data!$A$3:$G$23,4)","v":0.25},{"$f":"VLOOKUP(B4,data!$A$3:$G$23,5)","v":0.23749999999999999},{"$f":"VLOOKUP(B4,data!$A$3:$G$23,6)","v":0.18},{"$f":"VLOOKUP(B4,data!$A$3:$G$23,7)","v":0.12},{"$f":"IF(Z4=0,AA4,IF(Z4=1,AB4,IF(Z4=2,AC4,IF(Z4=3,AD4,IF(Z4=4,AE4,\"chyba\")))))","v":"chyba"},{"$f":"S4","v":1},{"$f":"Y4*AF4*AG4","v":{"$error":"#VALUE!"}}]
[{"$f":"konstrukce!B5","v":"Severní stěna 2"},1,{"$f":"VLOOKUP(vypocet!B5,data!$A$3:$B$23,2)","v":"Cihly plné 30 cm"},{"$f":"VLOOKUP(B5,data!$A$3:$C$23,3)","v":1.67},{"$f":"konstrukce!G5","v":0},0.13,0.04,{"$f":"1/D5-F5-G5","v":0.42880239520958091},{"$f":"1/(F5+G5+(E5/100)/$E$2+H5)","v":1.67},{"$f":"konstrukce!M5","v":0},1,{"$f":"I5*J5*K5","v":0},null,"Severní stěna 2",null,null,0.3,0,1,{"$f":"Q5*R5*S5","v":0},null,null,"Severní stěna 2",null,{"$f":"R5","v":0},{"$f":"Z4","v":"chyba"},{"$f":"I5","v":1.67},{"$f":"VLOOKUP(B5,data!$A$3:$G$23,4)","v":0.25},{"$f":"VLOOKUP(B5,data!$A$3:$G$23,5)","v":0.23749999999999999},{"$f":"VLOOKUP(B5,data!$A$3:$G$23,6)","v":0.18},{"$f":"VLOOKUP(B5,data!$A$3:$G$23,7)","v":0.12},{"$f":"IF(Z5=0,AA5,IF(Z5=1,AB5,IF(Z5=2,AC5,IF(Z5=3,AD5,IF(Z5=4,AE5,\"chyba\")))))","v":"chyba"},{"$f":"S5","v":1},{"$f":"Y5*AF5*AG5","v":{"$error":"#VALUE!"}}]
[null,null,null,null,null,null,null,null,null,null,null,0]
[{"$f":"konstrukce!B7","v":"Jižní stěna 1"},1,{"$f":"VLOOKUP(vypocet!B7,data!$A$3:$B$23,2)","v":"Cihly plné 30 cm"},{"$f":"VLOOKUP(B7,data!$A$3:$C$23,3)","v":1.67},{"$f":"konstrukce!G7","v":0},0.13,0.04,{"$f":"1/D7-F7-G7","v":0.42880239520958091},{"$f":"1/(F7+G7+(E7/100)/$E$2+H7)","v":1.67},{"$f":"konstrukce!M7","v":0},1,0,null,"Jižní stěna 1",null,null,0.3,0,1,0,null,null,"Jižní stěna 1",null,0,{"$f":"'navrh opatreni a vysledky'!Z5","v":0},1.67,{"$f":"VLOOKUP(B7,data!$A$3:$G$23,4)","v":0.25},{"$f":"VLOOKUP(B7,data!$A$3:$G$23,5)","v":0.23749999999999999},{"$f":"VLOOKUP(B7,data!$A$3:$G$23,6)","v":0.18},{"$f":"VLOOKUP(B7,data!$A$3:$G$23,7)","v":0.12},1.67,1,0]
[{"$f":"konstrukce!B8","v":"Jižní stěna 2"},1,{"$f":"VLOOKUP(vypocet!B8,data!$A$3:$B$23,2)","v":"Cihly plné 30 cm"},{"$f":"VLOOKUP(B8,data!$A$3:$C$23,3)","v":1.67},{"$f":"konstrukce!G8","v":0},0.13,0.04,0.42880239520958091,{"$f":"1/(F8+G8+(E8/100)/$E$2+H8)","v":1.67},{"$f":"konstrukce!M8","v":0},1,0,null,"Jižní stěna 2",null,null,0.3,0,1,0,null,null,"Jižní stěna 2",null,0,{"$f":"Z7","v":0},1.67,{"$f":"VLOOKUP(B8,data!$A$3:$G$23,4)","v":0.25},{"$f":"VLOOKUP(B8,data!$A$3:$G$23,5)","v":0.23749999999999999},{"$f":"VLOOKUP(B8,data!$A$3:$G$23,6)","v":0.18},{"$f":"VLOOKUP(B8,data!$A$3:$G$23,7)","v":0.12},1.67,1,0]
[null,null,null,null,null,null,null,null,null,null,null,0]
[{"$f":"konstrukce!B10","v":"Východní stěna 1"},1,{"$f":"VLOOKUP(vypocet!B10,data!$A$3:$B$23,2)","v":"Cihly plné 30 cm"},{"$f":"VLOOKUP(B10,data!$A$3:$C$23,3)","v":1.67},{"$f":"konstrukce!G10","v":0},0.13,0.04,{"$f":"1/D10-F10-G10","v":0.42880239520958091},{"$f":"1/(F10+G10+(E10/100)/$E$2+H10)","v":1.67},{"$f":"konstrukce!M10","v":0},1,0,null,"Východní stěna 1",null,null,0.3,0,1,0,null,null,"Východní stěna 1",null,0,{"$f":"'navrh opatreni a vysledky'!Z6","v":0},1.67,{"$f":"VLOOKUP(B10,data!$A$3:$G$23,4)","v":0.25},{"$f":"VLOOKUP(B10,data!$A$3:$G$23,5)","v":0.23749999999999999},{"$f":"VLOOKUP(B10,data!$A$3:$G$23,6)","v":0.18},{"$f":"VLOOKUP(B10,data!$A$3:$G$23,7)","v":0.12},1.67,1,0]
{"$rows_left_out":199}
{"sheet":"data","index":9,"n_rows":141,"n_cols":36,"rows_kept":141,"cut":false,"hidden":true,"merged":[]}
[null,"stěna","U","U Norm dop","U Norm*0,95","U pas min","U pas max",null,null,"klima",null,null,null,null,null,null,null,null,null,null,null,null,null,null,null,null,"Náklady A","s DPH",null,"C","C1",null,"uznatelné","C2",null,"uznatelné"]
[null,"konstrukce",null,null,null,null,null,null,null,"měsíc",null,null,null,"leden","únor","březen","duben","květen","červen","červenec","srpen","září","říjen","listopad","prosinec",null,null,null,null,"Bez výměny",0,0,0,0,0,0]
[1,"Cihly plné 30 cm",1.67,0.25,{"$f":"0.95*D3","v":0.23749999999999999},0.18,0.12,null,null,"průměrná venkovní teplota",null,"qe","[°C]",-1,1,4,9,14.6,17,18.2,18.8,13.8,9.4,4,-0.5,null,"obvodové stěny",1495,null,"Kotel na biomasu s ruční dodávkou paliva",50000,0.75,{"$f":"AE3/AF3","v":66666.666666666672},40000,0.55000000000000004,{"$f":"AH3/AI3","v":72727.272727272721}]
[2,"Cihly plné 45 cm",1.27,0.25,{"$f":"0.95*D4","v":0.23749999999999999},0.18,0.12,null,null,"intenzita slunečního záření","S","Is","[kWh/m2]",7,13,23,32,47,52,47,38,24,17,9,6,null,"otvorové výplně",6900,null,"Kotel na biomasu s automatickou dodávkou paliva",100000,0.75,{"$f":"AE4/AF4","v":133333.33333333334},80000,0.55000000000000004,{"$f":"AH4/AI4","v":145454.54545454544}]
[3,"Cihly plné 60 cm",1.03,0.25,0.23749999999999999,0.18,0.12,null,null,"intenzita slunečního záření","J","Is","[kWh/m2]",50,56,82,95,97,87,93,100,95,75,36,29,null,"střecha",1495,null,"Krbová kamna na biomasu s výměníkem s ruční dodávkou paliva",50000,0.75,66666.666666666672,40000,0.55000000000000004,72727.272727272721]
[4,"Zdivo smíšené 30 cm",2.91,0.25,0.23749999999999999,0.18,0.12,null,null,"intenzita slunečního záření","V","Is","[kWh/m2]",15,26,51,73.999999999999986,104,115,100,88,60,34,14,11,null,"vnitřní kce",575,null,"Krbová kamna na biomasu s výměníkem se samočinnou dodávkou paliva",55000,0.75,73333.333333333328,45000,0.55000000000000004,81818.181818181809]
[5,"Zdivo smíšené 45 cm",2.48,0.25,0.23749999999999999,0.18,0.12,null,null,"intenzita slunečního záření","Z","Is","[kWh/m2]",20,28,53,72,93,88,93,88,64,48,18,12,null,"podlaha nad sklepem",575,null,"Tepelné čerpadlo voda-voda",100000,0.75,133333.33333333334,80000,0.55000000000000004,145454.54545454544]
[6,"Zdivo smíšené 60 cm",2.16,0.25,0.23749999999999999,0.18,0.12,null,null,"intenzita slunečního záření","H","Is","[kWh/m2]",23,40,79,118,161,166,162,142.99999999999997,96,57,24,17,null,"podlaha na terénu",1955,null,"Tepelné čerpadlo země – voda",100000,0.75,133333.33333333334,80000,0.55000000000000004,145454.54545454544]
[7,"Děrované cihly 30 cm",1.56,0.25,0.23749999999999999,0.18,0.12,null,null,"intenzita slunečního záření","SV ","Is","[kWh/m2]",12,20,36,51,79,91,78,64,38,21,10,9,null,null,null,null,"Tepelné čerpadlo vzduch-voda",75000,0.75,100000,60000,0.55000000000000004,109090.90909090909]
[8,"Děrované cihly 45 cm",1.18,0.25,0.23749999999999999,0.18,0.12,null,null,"intenzita slunečního záření","SZ ","Is","[kWh/m2]",12,20,36.999999999999993,49,73,73,75,63,40,25,11,9,null,null,null,null,"Plynový kondenzační kotel",18000,0.75,24000,15000,0.55000000000000004,27272.727272727272]
{"$rows_left_out":132}
{"sheet":"doplnit","index":10,"n_rows":5,"n_cols":1,"rows_kept":5,"cut":false,"hidden":true,"merged":[]}
["korekční faktory pro stínění oken"]
["tepelné zisky"]
["podmínky C"]
["Bonusy"]
["opravit bonusy ve výpočtu"]